{"text_format":"1","workbook":"xlsx","n_sheets":4,"sheets":["マニュアル","入力","設定","計算"],"not_rendered":{"charts":0,"images":7,"macros":1,"external_links":0,"defined_names":2,"comments":0,"pivot_tables":0},"unopened":[],"bounds":{"document_bytes":16777216,"sheet_cells":100000,"rows_first":2000,"rows_last":500,"rows_between":2000,"halvings":0,"cell_chars":16384,"cell_head_chars":4096},"cells_cut":0,"cells_raw":0,"read":"whole","date_system":"1900"}

{"sheet":"マニュアル","index":0,"n_rows":126,"n_cols":18,"rows_kept":126,"cut":false,"hidden":true,"merged":[[125,0,127,18]]}
["✮管理者用マニュアル✮"]
[]
["1.年次更新時の変更方法"]
[]
[null,"「設定」シートを修正することにより、年度の更新を行うことができます。"]
[null,"変更可能な設定項目は以下の通りです。（「設定」シートの黄色いセル部分）"]
{"$rows_left_out":121}
{"sheet":"入力","index":1,"n_rows":50,"n_cols":24,"rows_kept":50,"cut":false,"hidden":false,"merged":[[21,3,21,4],[16,9,16,10],[27,9,27,10],[24,9,24,10],[25,9,25,10],[26,9,26,10],[21,9,21,11],[21,6,21,7],[36,4,36,5],[36,20,38,22],[36,23,38,25],[28,17,29,25],[30,17,32,25],[30,14,32,16],[34,20,35,22],[34,23,35,25],[28,14,29,16],[37,4,37,5],[37,6,37,7],[32,6,32,7],[32,3,32,4],[36,6,36,7],[31,6,31,7],[31,3,31,4],[3,2,3,26],[4,2,4,26],[8,13,8,24],[9,6,10,6],[7,19,7,23],[5,19,5,23],[9,2,10,2],[9,3,10,3],[9,5,10,5],[9,4,10,4],[9,7,10,7],[9,8,10,8],[8,7,8,8],[7,3,7,5],[8,3,8,5],[31,9,31,11],[32,9,32,11],[22,9,22,10],[23,9,23,10],[17,9,17,10],[21,14,22,16],[23,14,26,25],[21,17,22,25],[9,11,10,11],[8,9,8,10],[9,9,10,10],[9,12,9,23],[15,9,15,10],[11,9,11,10],[12,9,12,10],[13,9,13,10],[14,9,14,10]]}
[]
[]
[]
[null,null,"【入力手順】\n          ※初めに「入力リセット」を押下してください。\n\n①　加入される方の全員分の「生年月日」を入力してください。\n   　Ex)昭和５４年６月７日生まれの方の場合、S54.6.7と入力してください。(昭和：S　平成：H　令和：Ｒ）または西暦で1979/6/7と入力してください。\n　\n②～④　加入者ごとに前年中の給与収入・年金収入・その他の所得額を入力してください。\n　　非自発的失業者の軽減制度を反映させて計算する場合は、「非」欄に〇を入力してください。（給与所得額を手計算で30/100して入力する必要はありません。また給与収入と給与所得の両方に入力しないように注意してください。）\n\n⑤　加入日を入力してください。特に入力する必要のない場合は当年度の４月１日のままとしてください。（原則的に、加入月部分を直接削除しないでください。）\n\n*入力後は必ず２点をしてもらってください。２点者は、①～⑤の入力項目を確認してください。\n\n"]
[null,null,"【注意事項】\n\n・あくまで試算ですので実際の保険料と異なることがあります。 あらかじめご了承いただける場合のみ、ご利用ください。\n・国民健康保険の加入者が複数いる世帯で、加入者の加入・脱退月が一致しない場合（年度途中の加入・出生・後期加入）、一か月平均が正しく計算できません。\n・国民健康保険料の算定額が限度額を超えた場合は、世帯員の個人別内訳は正しく計算されません。 \n・国民健康保険の加入者が、専従者給与を支払い、又は受け取っている場合、計算が正しくならないことがあります。 \n・国民健康保険加入者に短期、長期譲渡所得があった場合、計算が正しくならないことがあります。 \n・均等割額の軽減制度、旧被扶養者の減免制度は、計算に反映されません。\n\n"]
[null,null,null,null,null,null,null,null,null,null,null,null,null,null,null,null,null,null,null,{"$f":"TODAY()","v":"2025-03-11"}]
{"$rows_left_out":45}
{"sheet":"設定","index":2,"n_rows":60,"n_cols":13,"rows_kept":60,"cut":false,"hidden":true,"merged":[]}
[null,"※　黄色のセル以外を修正する時は注意してください"]
[]
[null,"年","年度"]
[null,2025,{"$f":"DATE($B$4,1,1)","v":45658},null,{"$f":"TEXT(C4,\"[$-411]ggge\")&\"年度版　世田谷区　国民健康保険料　試算\"","v":"令和7年度版　世田谷区　国民健康保険料　試算"}]
[]
["月",4,5,6,7,8,9,10,11,12,1,2,3]
{"$rows_left_out":55}
{"sheet":"計算","index":3,"n_rows":47,"n_cols":23,"rows_kept":47,"cut":false,"hidden":true,"merged":[]}
[]
[null,"給与所得","年金所得","賦課基準額","4月","5月","6月","7月","8月","9月","10月","11月","12月","1月","2月","3月","加入月","介護月","基礎分","支援金分","介護分",null,"未就学児　　判定年月日"]
["世帯員Ａ",{"$f":"IF(入力!G13=\"〇\",INT(IF(入力!E13<>0,入力!E13,VLOOKUP(入力!D13,設定!$B$13:$F$23,2,TRUE)+INT(入力!D13/VLOOKUP(入力!D13,設定!$B$13:$F$23,3,TRUE))*VLOOKUP(入力!D13,設定!$B$13:$F$23,3,TRUE)*VLOOKUP(入力!D13,設定!$B$13:$F$23,4,TRUE)-VLOOKUP(入力!D13,設定!$B$13:$F$23,5,TRUE))*0.3),INT(IF(入力!E13<>0,入力!E13,VLOOKUP(入力!D13,設定!$B$13:$F$23,2,TRUE)+INT(入力!D13/VLOOKUP(入力!D13,設定!$B$13:$F$23,3,TRUE))*VLOOKUP(入力!D13,設定!$B$13:$F$23,3,TRUE)*VLOOKUP(入力!D13,設定!$B$13:$F$23,4,TRUE)-VLOOKUP(入力!D13,設定!$B$13:$F$23,5,TRUE))))","v":0},{"$f":"IF(入力!C13>=設定!$C$4,0,IF(DATEDIF(入力!C13,設定!$C$4,\"y\")<65,INT(入力!H13*VLOOKUP(入力!H13,設定!$B$28:$D$33,2,TRUE)-VLOOKUP(入力!H13,設定!$B$28:$D$33,3,TRUE)),INT(入力!H13*VLOOKUP(入力!H13,設定!$B$37:$D$42,2,TRUE)-VLOOKUP(入力!H13,設定!$B$37:$D$42,3,TRUE))))","v":0},{"$f":"MAX(B3+$C3+入力!$J13-設定!$B$47,0)","v":0},{"$f":"IF(入力!$C$20>設定!$B$8,\"\",IF(入力!$C$13>設定!$B$8,\"\",IF(ISBLANK(入力!$C13),\"\",IF(DATEDIF(入力!$C13,設定!B$8+1,\"y\")>=40,IF(DATEDIF(入力!$C13,設定!B$8+1,\"y\")>=65,IF(DATEDIF(入力!$C13,設定!B$8,\"y\")>=75,\"\",1),4),1))))","v":""},{"$f":"IF(入力!$C$20>設定!C8,\"\",IF(入力!$C$13>設定!C8,\"\",IF(ISBLANK(入力!$C13),\"\",IF(DATEDIF(入力!$C13,設定!C$8+1,\"y\")>=40,IF(DATEDIF(入力!$C13,設定!C$8+1,\"y\")>=65,IF(DATEDIF(入力!$C13,設定!C$8,\"y\")>=75,\"\",1),4),1))))","v":""},{"$f":"IF(入力!$C$20>設定!D8,\"\",IF(入力!$C$13>設定!D8,\"\",IF(ISBLANK(入力!$C13),\"\",IF(DATEDIF(入力!$C13,設定!D$8+1,\"y\")>=40,IF(DATEDIF(入力!$C13,設定!D$8+1,\"y\")>=65,IF(DATEDIF(入力!$C13,設定!D$8,\"y\")>=75,\"\",1),4),1))))","v":""},{"$f":"IF(入力!$C$20>設定!E8,\"\",IF(入力!$C$13>設定!E8,\"\",IF(ISBLANK(入力!$C13),\"\",IF(DATEDIF(入力!$C13,設定!E$8+1,\"y\")>=40,IF(DATEDIF(入力!$C13,設定!E$8+1,\"y\")>=65,IF(DATEDIF(入力!$C13,設定!E$8,\"y\")>=75,\"\",1),4),1))))","v":""},{"$f":"IF(入力!$C$20>設定!F8,\"\",IF(入力!$C$13>設定!F8,\"\",IF(ISBLANK(入力!$C13),\"\",IF(DATEDIF(入力!$C13,設定!F$8+1,\"y\")>=40,IF(DATEDIF(入力!$C13,設定!F$8+1,\"y\")>=65,IF(DATEDIF(入力!$C13,設定!F$8,\"y\")>=75,\"\",1),4),1))))","v":""},{"$f":"IF(入力!$C$20>設定!G8,\"\",IF(入力!$C$13>設定!G8,\"\",IF(ISBLANK(入力!$C13),\"\",IF(DATEDIF(入力!$C13,設定!G$8+1,\"y\")>=40,IF(DATEDIF(入力!$C13,設定!G$8+1,\"y\")>=65,IF(DATEDIF(入力!$C13,設定!G$8,\"y\")>=75,\"\",1),4),1))))","v":""},{"$f":"IF(入力!$C$20>設定!H8,\"\",IF(入力!$C$13>設定!H8,\"\",IF(ISBLANK(入力!$C13),\"\",IF(DATEDIF(入力!$C13,設定!H$8+1,\"y\")>=40,IF(DATEDIF(入力!$C13,設定!H$8+1,\"y\")>=65,IF(DATEDIF(入力!$C13,設定!H$8,\"y\")>=75,\"\",1),4),1))))","v":""},{"$f":"IF(入力!$C$20>設定!I8,\"\",IF(入力!$C$13>設定!I8,\"\",IF(ISBLANK(入力!$C13),\"\",IF(DATEDIF(入力!$C13,設定!I$8+1,\"y\")>=40,IF(DATEDIF(入力!$C13,設定!I$8+1,\"y\")>=65,IF(DATEDIF(入力!$C13,設定!I$8,\"y\")>=75,\"\",1),4),1))))","v":""},{"$f":"IF(入力!$C$20>設定!J8,\"\",IF(入力!$C$13>設定!J8,\"\",IF(ISBLANK(入力!$C13),\"\",IF(DATEDIF(入力!$C13,設定!J$8+1,\"y\")>=40,IF(DATEDIF(入力!$C13,設定!J$8+1,\"y\")>=65,IF(DATEDIF(入力!$C13,設定!J$8,\"y\")>=75,\"\",1),4),1))))","v":""},{"$f":"IF(入力!$C$20>設定!K8,\"\",IF(入力!$C$13>設定!K8,\"\",IF(ISBLANK(入力!$C13),\"\",IF(DATEDIF(入力!$C13,設定!K$8+1,\"y\")>=40,IF(DATEDIF(入力!$C13,設定!K$8+1,\"y\")>=65,IF(DATEDIF(入力!$C13,設定!K$8,\"y\")>=75,\"\",1),4),1))))","v":""},{"$f":"IF(入力!$C$20>設定!L8,\"\",IF(入力!$C$13>設定!L8,\"\",IF(ISBLANK(入力!$C13),\"\",IF(DATEDIF(入力!$C13,設定!L$8+1,\"y\")>=40,IF(DATEDIF(入力!$C13,設定!L$8+1,\"y\")>=65,IF(DATEDIF(入力!$C13,設定!L$8,\"y\")>=75,\"\",1),4),1))))","v":""},{"$f":"IF(入力!$C$20>設定!M8,\"\",IF(入力!$C$13>設定!M8,\"\",IF(ISBLANK(入力!$C13),\"\",IF(DATEDIF(入力!$C13,設定!M$8+1,\"y\")>=40,IF(DATEDIF(入力!$C13,設定!M$8+1,\"y\")>=65,IF(DATEDIF(入力!$C13,設定!M$8,\"y\")>=75,\"\",1),4),1))))","v":""},{"$f":"COUNTIF(入力!$M13:$X13,\">=1\")","v":0},{"$f":"COUNTIF(入力!$M13:$X13,\"=4\")","v":0},{"$f":"IF(入力!$C$13>W3,INT(INT((設定!B52/2)*$Q3/12)+INT(($D3*設定!$C$52)*$Q3/12)),INT(INT((設定!$B$52)*$Q3/12)+INT(($D3*設定!$C$52)*$Q3/12)))","v":0},{"$f":"IF(入力!$C$13>W3,INT(INT((設定!B56/2)*$Q3/12)+INT(($D3*設定!$C$56)*$Q3/12)),INT(INT((設定!$B$56)*$Q3/12)+INT(($D3*設定!$C$56)*$Q3/12)))","v":0},{"$f":"INT(INT((設定!$B$60)*$R3/12)+INT(($D3*設定!$C$60)*$R3/12))","v":0},null,"2019-04-01"]
["世帯員Ｂ",{"$f":"IF(入力!G14=\"〇\",INT(IF(入力!E14<>0,入力!E14,VLOOKUP(入力!D14,設定!$B$13:$F$23,2,TRUE)+INT(入力!D14/VLOOKUP(入力!D14,設定!$B$13:$F$23,3,TRUE))*VLOOKUP(入力!D14,設定!$B$13:$F$23,3,TRUE)*VLOOKUP(入力!D14,設定!$B$13:$F$23,4,TRUE)-VLOOKUP(入力!D14,設定!$B$13:$F$23,5,TRUE))*0.3),INT(IF(入力!E14<>0,入力!E14,VLOOKUP(入力!D14,設定!$B$13:$F$23,2,TRUE)+INT(入力!D14/VLOOKUP(入力!D14,設定!$B$13:$F$23,3,TRUE))*VLOOKUP(入力!D14,設定!$B$13:$F$23,3,TRUE)*VLOOKUP(入力!D14,設定!$B$13:$F$23,4,TRUE)-VLOOKUP(入力!D14,設定!$B$13:$F$23,5,TRUE))))","v":0},{"$f":"IF(入力!C14>=設定!$C$4,0,IF(DATEDIF(入力!C14,設定!$C$4,\"y\")<65,INT(入力!H14*VLOOKUP(入力!H14,設定!$B$28:$D$33,2,TRUE)-VLOOKUP(入力!H14,設定!$B$28:$D$33,3,TRUE)),INT(入力!H14*VLOOKUP(入力!H14,設定!$B$37:$D$42,2,TRUE)-VLOOKUP(入力!H14,設定!$B$37:$D$42,3,TRUE))))","v":0},{"$f":"MAX(B4+$C4+入力!$J14-設定!$B$47,0)","v":0},{"$f":"IF(入力!$C$20>設定!B8,\"\",IF(入力!$C$14>設定!B8,\"\",IF(ISBLANK(入力!$C14),\"\",IF(DATEDIF(入力!$C14,設定!B$8+1,\"y\")>=40,IF(DATEDIF(入力!$C14,設定!B$8+1,\"y\")>=65,IF(DATEDIF(入力!$C14,設定!B$8,\"y\")>=75,\"\",1),4),1))))","v":""},{"$f":"IF(入力!$C$20>設定!C8,\"\",IF(入力!$C$14>設定!C8,\"\",IF(ISBLANK(入力!$C14),\"\",IF(DATEDIF(入力!$C14,設定!C$8+1,\"y\")>=40,IF(DATEDIF(入力!$C14,設定!C$8+1,\"y\")>=65,IF(DATEDIF(入力!$C14,設定!C$8,\"y\")>=75,\"\",1),4),1))))","v":""},{"$f":"IF(入力!$C$20>設定!D8,\"\",IF(入力!$C$14>設定!D8,\"\",IF(ISBLANK(入力!$C14),\"\",IF(DATEDIF(入力!$C14,設定!D$8+1,\"y\")>=40,IF(DATEDIF(入力!$C14,設定!D$8+1,\"y\")>=65,IF(DATEDIF(入力!$C14,設定!D$8,\"y\")>=75,\"\",1),4),1))))","v":""},{"$f":"IF(入力!$C$20>設定!E8,\"\",IF(入力!$C$14>設定!E8,\"\",IF(ISBLANK(入力!$C14),\"\",IF(DATEDIF(入力!$C14,設定!E$8+1,\"y\")>=40,IF(DATEDIF(入力!$C14,設定!E$8+1,\"y\")>=65,IF(DATEDIF(入力!$C14,設定!E$8,\"y\")>=75,\"\",1),4),1))))","v":""},{"$f":"IF(入力!$C$20>設定!F8,\"\",IF(入力!$C$14>設定!F8,\"\",IF(ISBLANK(入力!$C14),\"\",IF(DATEDIF(入力!$C14,設定!F$8+1,\"y\")>=40,IF(DATEDIF(入力!$C14,設定!F$8+1,\"y\")>=65,IF(DATEDIF(入力!$C14,設定!F$8,\"y\")>=75,\"\",1),4),1))))","v":""},{"$f":"IF(入力!$C$20>設定!G8,\"\",IF(入力!$C$14>設定!G8,\"\",IF(ISBLANK(入力!$C14),\"\",IF(DATEDIF(入力!$C14,設定!G$8+1,\"y\")>=40,IF(DATEDIF(入力!$C14,設定!G$8+1,\"y\")>=65,IF(DATEDIF(入力!$C14,設定!G$8,\"y\")>=75,\"\",1),4),1))))","v":""},{"$f":"IF(入力!$C$20>設定!H8,\"\",IF(入力!$C$14>設定!H8,\"\",IF(ISBLANK(入力!$C14),\"\",IF(DATEDIF(入力!$C14,設定!H$8+1,\"y\")>=40,IF(DATEDIF(入力!$C14,設定!H$8+1,\"y\")>=65,IF(DATEDIF(入力!$C14,設定!H$8,\"y\")>=75,\"\",1),4),1))))","v":""},{"$f":"IF(入力!$C$20>設定!I8,\"\",IF(入力!$C$14>設定!I8,\"\",IF(ISBLANK(入力!$C14),\"\",IF(DATEDIF(入力!$C14,設定!I$8+1,\"y\")>=40,IF(DATEDIF(入力!$C14,設定!I$8+1,\"y\")>=65,IF(DATEDIF(入力!$C14,設定!I$8,\"y\")>=75,\"\",1),4),1))))","v":""},{"$f":"IF(入力!$C$20>設定!J8,\"\",IF(入力!$C$14>設定!J8,\"\",IF(ISBLANK(入力!$C14),\"\",IF(DATEDIF(入力!$C14,設定!J$8+1,\"y\")>=40,IF(DATEDIF(入力!$C14,設定!J$8+1,\"y\")>=65,IF(DATEDIF(入力!$C14,設定!J$8,\"y\")>=75,\"\",1),4),1))))","v":""},{"$f":"IF(入力!$C$20>設定!K8,\"\",IF(入力!$C$14>設定!K8,\"\",IF(ISBLANK(入力!$C14),\"\",IF(DATEDIF(入力!$C14,設定!K$8+1,\"y\")>=40,IF(DATEDIF(入力!$C14,設定!K$8+1,\"y\")>=65,IF(DATEDIF(入力!$C14,設定!K$8,\"y\")>=75,\"\",1),4),1))))","v":""},{"$f":"IF(入力!$C$20>設定!L8,\"\",IF(入力!$C$14>設定!L8,\"\",IF(ISBLANK(入力!$C14),\"\",IF(DATEDIF(入力!$C14,設定!L$8+1,\"y\")>=40,IF(DATEDIF(入力!$C14,設定!L$8+1,\"y\")>=65,IF(DATEDIF(入力!$C14,設定!L$8,\"y\")>=75,\"\",1),4),1))))","v":""},{"$f":"IF(入力!$C$20>設定!M8,\"\",IF(入力!$C$14>設定!M8,\"\",IF(ISBLANK(入力!$C14),\"\",IF(DATEDIF(入力!$C14,設定!M$8+1,\"y\")>=40,IF(DATEDIF(入力!$C14,設定!M$8+1,\"y\")>=65,IF(DATEDIF(入力!$C14,設定!M$8,\"y\")>=75,\"\",1),4),1))))","v":""},{"$f":"COUNTIF(入力!$M14:$X14,\">=1\")","v":0},{"$f":"COUNTIF(入力!$M14:$X14,\"=4\")","v":0},{"$f":"IF(入力!$C$14>W3,INT(INT((設定!B52/2)*$Q4/12)+INT(($D4*設定!$C$52)*$Q4/12)),INT(INT((設定!$B$52)*$Q4/12)+INT(($D4*設定!$C$52)*$Q4/12)))","v":0},{"$f":"IF(入力!$C$14>W3,INT(INT((設定!B56/2)*$Q4/12)+INT(($D4*設定!$C$56)*$Q4/12)),INT(INT((設定!$B$56)*$Q4/12)+INT(($D4*設定!$C$56)*$Q4/12)))","v":0},{"$f":"INT(INT((設定!$B$60)*$R4/12)+INT(($D4*設定!$C$60)*$R4/12))","v":0}]
["世帯員Ｃ",{"$f":"IF(入力!G15=\"〇\",INT(IF(入力!E15<>0,入力!E15,VLOOKUP(入力!D15,設定!$B$13:$F$23,2,TRUE)+INT(入力!D15/VLOOKUP(入力!D15,設定!$B$13:$F$23,3,TRUE))*VLOOKUP(入力!D15,設定!$B$13:$F$23,3,TRUE)*VLOOKUP(入力!D15,設定!$B$13:$F$23,4,TRUE)-VLOOKUP(入力!D15,設定!$B$13:$F$23,5,TRUE))*0.3),INT(IF(入力!E15<>0,入力!E15,VLOOKUP(入力!D15,設定!$B$13:$F$23,2,TRUE)+INT(入力!D15/VLOOKUP(入力!D15,設定!$B$13:$F$23,3,TRUE))*VLOOKUP(入力!D15,設定!$B$13:$F$23,3,TRUE)*VLOOKUP(入力!D15,設定!$B$13:$F$23,4,TRUE)-VLOOKUP(入力!D15,設定!$B$13:$F$23,5,TRUE))))","v":0},{"$f":"IF(入力!C15>=設定!$C$4,0,IF(DATEDIF(入力!C15,設定!$C$4,\"y\")<65,INT(入力!H15*VLOOKUP(入力!H15,設定!$B$28:$D$33,2,TRUE)-VLOOKUP(入力!H15,設定!$B$28:$D$33,3,TRUE)),INT(入力!H15*VLOOKUP(入力!H15,設定!$B$37:$D$42,2,TRUE)-VLOOKUP(入力!H15,設定!$B$37:$D$42,3,TRUE))))","v":0},{"$f":"MAX(B5+$C5+入力!$J15-設定!$B$47,0)","v":0},{"$f":"IF(入力!$C$20>設定!$B$8,\"\",IF(入力!$C15>設定!$B$8,\"\",IF(ISBLANK(入力!$C15),\"\",IF(DATEDIF(入力!$C15,設定!B$8+1,\"y\")>=40,IF(DATEDIF(入力!$C15,設定!B$8+1,\"y\")>=65,IF(DATEDIF(入力!$C15,設定!B$8,\"y\")>=75,\"\",1),4),1))))","v":""},{"$f":"IF(入力!$C$20>設定!C8,\"\",IF(入力!$C$15>設定!C8,\"\",IF(ISBLANK(入力!$C15),\"\",IF(DATEDIF(入力!$C15,設定!C$8+1,\"y\")>=40,IF(DATEDIF(入力!$C15,設定!C$8+1,\"y\")>=65,IF(DATEDIF(入力!$C15,設定!C$8,\"y\")>=75,\"\",1),4),1))))","v":""},{"$f":"IF(入力!$C$20>設定!D8,\"\",IF(入力!$C$15>設定!D8,\"\",IF(ISBLANK(入力!$C15),\"\",IF(DATEDIF(入力!$C15,設定!D$8+1,\"y\")>=40,IF(DATEDIF(入力!$C15,設定!D$8+1,\"y\")>=65,IF(DATEDIF(入力!$C15,設定!D$8,\"y\")>=75,\"\",1),4),1))))","v":""},{"$f":"IF(入力!$C$20>設定!E8,\"\",IF(入力!$C$15>設定!E8,\"\",IF(ISBLANK(入力!$C15),\"\",IF(DATEDIF(入力!$C15,設定!E$8+1,\"y\")>=40,IF(DATEDIF(入力!$C15,設定!E$8+1,\"y\")>=65,IF(DATEDIF(入力!$C15,設定!E$8,\"y\")>=75,\"\",1),4),1))))","v":""},{"$f":"IF(入力!$C$20>設定!F8,\"\",IF(入力!$C$15>設定!F8,\"\",IF(ISBLANK(入力!$C15),\"\",IF(DATEDIF(入力!$C15,設定!F$8+1,\"y\")>=40,IF(DATEDIF(入力!$C15,設定!F$8+1,\"y\")>=65,IF(DATEDIF(入力!$C15,設定!F$8,\"y\")>=75,\"\",1),4),1))))","v":""},{"$f":"IF(入力!$C$20>設定!G8,\"\",IF(入力!$C$15>設定!G8,\"\",IF(ISBLANK(入力!$C15),\"\",IF(DATEDIF(入力!$C15,設定!G$8+1,\"y\")>=40,IF(DATEDIF(入力!$C15,設定!G$8+1,\"y\")>=65,IF(DATEDIF(入力!$C15,設定!G$8,\"y\")>=75,\"\",1),4),1))))","v":""},{"$f":"IF(入力!$C$20>設定!H8,\"\",IF(入力!$C$15>設定!H8,\"\",IF(ISBLANK(入力!$C15),\"\",IF(DATEDIF(入力!$C15,設定!H$8+1,\"y\")>=40,IF(DATEDIF(入力!$C15,設定!H$8+1,\"y\")>=65,IF(DATEDIF(入力!$C15,設定!H$8,\"y\")>=75,\"\",1),4),1))))","v":""},{"$f":"IF(入力!$C$20>設定!I8,\"\",IF(入力!$C$15>設定!I8,\"\",IF(ISBLANK(入力!$C15),\"\",IF(DATEDIF(入力!$C15,設定!I$8+1,\"y\")>=40,IF(DATEDIF(入力!$C15,設定!I$8+1,\"y\")>=65,IF(DATEDIF(入力!$C15,設定!I$8,\"y\")>=75,\"\",1),4),1))))","v":""},{"$f":"IF(入力!$C$20>設定!J8,\"\",IF(入力!$C$15>設定!J8,\"\",IF(ISBLANK(入力!$C15),\"\",IF(DATEDIF(入力!$C15,設定!J$8+1,\"y\")>=40,IF(DATEDIF(入力!$C15,設定!J$8+1,\"y\")>=65,IF(DATEDIF(入力!$C15,設定!J$8,\"y\")>=75,\"\",1),4),1))))","v":""},{"$f":"IF(入力!$C$20>設定!K8,\"\",IF(入力!$C$15>設定!K8,\"\",IF(ISBLANK(入力!$C15),\"\",IF(DATEDIF(入力!$C15,設定!K$8+1,\"y\")>=40,IF(DATEDIF(入力!$C15,設定!K$8+1,\"y\")>=65,IF(DATEDIF(入力!$C15,設定!K$8,\"y\")>=75,\"\",1),4),1))))","v":""},{"$f":"IF(入力!$C$20>設定!L8,\"\",IF(入力!$C$15>設定!L8,\"\",IF(ISBLANK(入力!$C15),\"\",IF(DATEDIF(入力!$C15,設定!L$8+1,\"y\")>=40,IF(DATEDIF(入力!$C15,設定!L$8+1,\"y\")>=65,IF(DATEDIF(入力!$C15,設定!L$8,\"y\")>=75,\"\",1),4),1))))","v":""},{"$f":"IF(入力!$C$20>設定!M8,\"\",IF(入力!$C$15>設定!M8,\"\",IF(ISBLANK(入力!$C15),\"\",IF(DATEDIF(入力!$C15,設定!M$8+1,\"y\")>=40,IF(DATEDIF(入力!$C15,設定!M$8+1,\"y\")>=65,IF(DATEDIF(入力!$C15,設定!M$8,\"y\")>=75,\"\",1),4),1))))","v":""},{"$f":"COUNTIF(入力!$M15:$X15,\">=1\")","v":0},{"$f":"COUNTIF(入力!$M15:$X15,\"=4\")","v":0},{"$f":"IF(入力!$C$15>W3,INT(INT((設定!B52/2)*$Q5/12)+INT(($D5*設定!$C$52)*$Q5/12)),INT(INT((設定!$B$52)*$Q5/12)+INT(($D5*設定!$C$52)*$Q5/12)))","v":0},{"$f":"IF(入力!$C$15>W3,INT(INT((設定!B56/2)*$Q5/12)+INT(($D5*設定!$C$56)*$Q5/12)),INT(INT((設定!$B$56)*$Q5/12)+INT(($D5*設定!$C$56)*$Q5/12)))","v":0},{"$f":"INT(INT((設定!$B$60)*$R5/12)+INT(($D5*設定!$C$60)*$R5/12))","v":0}]
["世帯員Ｄ",{"$f":"IF(入力!G16=\"〇\",INT(IF(入力!E16<>0,入力!E16,VLOOKUP(入力!D16,設定!$B$13:$F$23,2,TRUE)+INT(入力!D16/VLOOKUP(入力!D16,設定!$B$13:$F$23,3,TRUE))*VLOOKUP(入力!D16,設定!$B$13:$F$23,3,TRUE)*VLOOKUP(入力!D16,設定!$B$13:$F$23,4,TRUE)-VLOOKUP(入力!D16,設定!$B$13:$F$23,5,TRUE))*0.3),INT(IF(入力!E16<>0,入力!E16,VLOOKUP(入力!D16,設定!$B$13:$F$23,2,TRUE)+INT(入力!D16/VLOOKUP(入力!D16,設定!$B$13:$F$23,3,TRUE))*VLOOKUP(入力!D16,設定!$B$13:$F$23,3,TRUE)*VLOOKUP(入力!D16,設定!$B$13:$F$23,4,TRUE)-VLOOKUP(入力!D16,設定!$B$13:$F$23,5,TRUE))))","v":0},{"$f":"IF(入力!C16>=設定!$C$4,0,IF(DATEDIF(入力!C16,設定!$C$4,\"y\")<65,INT(入力!H16*VLOOKUP(入力!H16,設定!$B$28:$D$33,2,TRUE)-VLOOKUP(入力!H16,設定!$B$28:$D$33,3,TRUE)),INT(入力!H16*VLOOKUP(入力!H16,設定!$B$37:$D$42,2,TRUE)-VLOOKUP(入力!H16,設定!$B$37:$D$42,3,TRUE))))","v":0},{"$f":"MAX(B6+$C6+入力!$J16-設定!$B$47,0)","v":0},{"$f":"IF(入力!$C$20>設定!B8,\"\",IF(入力!$C16>設定!B8,\"\",IF(ISBLANK(入力!$C16),\"\",IF(DATEDIF(入力!$C16,設定!B$8+1,\"y\")>=40,IF(DATEDIF(入力!$C16,設定!B$8+1,\"y\")>=65,IF(DATEDIF(入力!$C16,設定!B$8,\"y\")>=75,\"\",1),4),1))))","v":""},{"$f":"IF(入力!$C$20>設定!C8,\"\",IF(入力!$C16>設定!C8,\"\",IF(ISBLANK(入力!$C16),\"\",IF(DATEDIF(入力!$C16,設定!C$8+1,\"y\")>=40,IF(DATEDIF(入力!$C16,設定!C$8+1,\"y\")>=65,IF(DATEDIF(入力!$C16,設定!C$8,\"y\")>=75,\"\",1),4),1))))","v":""},{"$f":"IF(入力!$C$20>設定!D8,\"\",IF(入力!$C16>設定!D8,\"\",IF(ISBLANK(入力!$C16),\"\",IF(DATEDIF(入力!$C16,設定!D$8+1,\"y\")>=40,IF(DATEDIF(入力!$C16,設定!D$8+1,\"y\")>=65,IF(DATEDIF(入力!$C16,設定!D$8,\"y\")>=75,\"\",1),4),1))))","v":""},{"$f":"IF(入力!$C$20>設定!E8,\"\",IF(入力!$C16>設定!E8,\"\",IF(ISBLANK(入力!$C16),\"\",IF(DATEDIF(入力!$C16,設定!E$8+1,\"y\")>=40,IF(DATEDIF(入力!$C16,設定!E$8+1,\"y\")>=65,IF(DATEDIF(入力!$C16,設定!E$8,\"y\")>=75,\"\",1),4),1))))","v":""},{"$f":"IF(入力!$C$20>設定!F8,\"\",IF(入力!$C16>設定!F8,\"\",IF(ISBLANK(入力!$C16),\"\",IF(DATEDIF(入力!$C16,設定!F$8+1,\"y\")>=40,IF(DATEDIF(入力!$C16,設定!F$8+1,\"y\")>=65,IF(DATEDIF(入力!$C16,設定!F$8,\"y\")>=75,\"\",1),4),1))))","v":""},{"$f":"IF(入力!$C$20>設定!G8,\"\",IF(入力!$C16>設定!G8,\"\",IF(ISBLANK(入力!$C16),\"\",IF(DATEDIF(入力!$C16,設定!G$8+1,\"y\")>=40,IF(DATEDIF(入力!$C16,設定!G$8+1,\"y\")>=65,IF(DATEDIF(入力!$C16,設定!G$8,\"y\")>=75,\"\",1),4),1))))","v":""},{"$f":"IF(入力!$C$20>設定!H8,\"\",IF(入力!$C16>設定!H8,\"\",IF(ISBLANK(入力!$C16),\"\",IF(DATEDIF(入力!$C16,設定!H$8+1,\"y\")>=40,IF(DATEDIF(入力!$C16,設定!H$8+1,\"y\")>=65,IF(DATEDIF(入力!$C16,設定!H$8,\"y\")>=75,\"\",1),4),1))))","v":""},{"$f":"IF(入力!$C$20>設定!I8,\"\",IF(入力!$C16>設定!I8,\"\",IF(ISBLANK(入力!$C16),\"\",IF(DATEDIF(入力!$C16,設定!I$8+1,\"y\")>=40,IF(DATEDIF(入力!$C16,設定!I$8+1,\"y\")>=65,IF(DATEDIF(入力!$C16,設定!I$8,\"y\")>=75,\"\",1),4),1))))","v":""},{"$f":"IF(入力!$C$20>設定!J8,\"\",IF(入力!$C16>設定!J8,\"\",IF(ISBLANK(入力!$C16),\"\",IF(DATEDIF(入力!$C16,設定!J$8+1,\"y\")>=40,IF(DATEDIF(入力!$C16,設定!J$8+1,\"y\")>=65,IF(DATEDIF(入力!$C16,設定!J$8,\"y\")>=75,\"\",1),4),1))))","v":""},{"$f":"IF(入力!$C$20>設定!K8,\"\",IF(入力!$C16>設定!K8,\"\",IF(ISBLANK(入力!$C16),\"\",IF(DATEDIF(入力!$C16,設定!K$8+1,\"y\")>=40,IF(DATEDIF(入力!$C16,設定!K$8+1,\"y\")>=65,IF(DATEDIF(入力!$C16,設定!K$8,\"y\")>=75,\"\",1),4),1))))","v":""},{"$f":"IF(入力!$C$20>設定!L8,\"\",IF(入力!$C16>設定!L8,\"\",IF(ISBLANK(入力!$C16),\"\",IF(DATEDIF(入力!$C16,設定!L$8+1,\"y\")>=40,IF(DATEDIF(入力!$C16,設定!L$8+1,\"y\")>=65,IF(DATEDIF(入力!$C16,設定!L$8,\"y\")>=75,\"\",1),4),1))))","v":""},{"$f":"IF(入力!$C$20>設定!M8,\"\",IF(入力!$C16>設定!M8,\"\",IF(ISBLANK(入力!$C16),\"\",IF(DATEDIF(入力!$C16,設定!M$8+1,\"y\")>=40,IF(DATEDIF(入力!$C16,設定!M$8+1,\"y\")>=65,IF(DATEDIF(入力!$C16,設定!M$8,\"y\")>=75,\"\",1),4),1))))","v":""},{"$f":"COUNTIF(入力!$M16:$X16,\">=1\")","v":0},{"$f":"COUNTIF(入力!$M16:$X16,\"=4\")","v":0},{"$f":"IF(入力!$C$16>W3,INT(INT((設定!B52/2)*$Q6/12)+INT(($D6*設定!$C$52)*$Q6/12)),INT(INT((設定!$B$52)*$Q6/12)+INT(($D6*設定!$C$52)*$Q6/12)))","v":0},{"$f":"IF(入力!$C$16>W3,INT(INT((設定!B56/2)*$Q6/12)+INT(($D6*設定!$C$56)*$Q6/12)),INT(INT((設定!$B$56)*$Q6/12)+INT(($D6*設定!$C$56)*$Q6/12)))","v":0},{"$f":"INT(INT((設定!$B$60)*$R6/12)+INT(($D6*設定!$C$60)*$R6/12))","v":0}]
{"$rows_left_out":41}